{"text_format":"1","workbook":"xlsx","n_sheets":12,"sheets":["Control","AUX2","Net42","Net41","Net32","Net31","Net22","Net21","Net12","Net11","AUX","specs"],"not_rendered":{"charts":0,"images":554,"macros":1,"external_links":0,"defined_names":2,"comments":0,"pivot_tables":0},"unopened":[],"bounds":{"document_bytes":16777216,"sheet_cells":100000,"rows_first":2000,"rows_last":500,"rows_between":2000,"halvings":0,"cell_chars":16384,"cell_head_chars":4096},"cells_cut":0,"cells_raw":0,"read":"whole","date_system":"1900"}

{"sheet":"Control","index":0,"n_rows":8,"n_cols":5,"rows_kept":8,"cut":false,"hidden":false,"merged":[]}
[]
[]
[]
[]
[]
[null,null,null,null,"PS actual power"]
{"$rows_left_out":3}
{"sheet":"AUX2","index":1,"n_rows":73,"n_cols":22,"rows_kept":73,"cut":false,"hidden":true,"merged":[[3,15,3,16],[47,0,51,17],[59,4,59,5],[59,6,59,7]]}
[{"$f":"'Net42'!B1+'Net41'!B1+'Net32'!B1+'Net31'!B1+'Net22'!B1+'Net21'!B1+'Net12'!B1+'Net11'!B1+SUM(A7:A18)","v":0},"Vtriac(vba)",1.5,{"$f":"+'Net11'!D1+'Net12'!D1+'Net21'!D1+'Net22'!D1+'Net31'!D1+'Net32'!D1+'Net41'!D1+'Net42'!D1","v":0},null,null,null,null,null,null,null,null,null,null,null,null,null,null,66,"66V","V0",1]
[null,null,{"$f":"+C5*1","v":66},null,null,null,null,null,null,"m",null,null,null,null,null,null,null,null,61.802129379414225,"61,8V","V01",2]
[null,null,null,null,null,null,null,null,null,"ft",null,null,null,null,null,null,null,null,62.217145308323502,"62,2V","V02",3]
[null,null,null,"V","m","i temp","i","drop","k","dist","L","cable","Vinput",1E-4,null,null,null,null,63.091997970258099,"63,1V","V03",4]
["PS - Imax Vout",15,"66","V","-","A","A","V","-","m","km",null,"V","accuracy",null,null,null,null,63.091931522576296,"63,1V","V04",5]
["Vmin amp.",44,{"$f":"IF(C2=60,66,90)","v":90},63.091997970258099,null,null,null,null,null,null,null,null,null,{"$f":"ABS(SUM(N7:N14))","v":1.0724305994358474E-5},null,null,null,null,2.0154231201887813,"2A","I01",6]
{"$rows_left_out":68}
{"sheet":"Net42","index":2,"n_rows":34,"n_cols":15,"rows_kept":34,"cut":false,"hidden":true,"merged":[[0,7,0,11],[23,2,24,10],[33,5,34,7],[26,12,27,12]]}
[null,{"$f":"SUM(F22:O22)","v":0},null,{"$f":"IF(O21<'AUX2'!B6,1,0)","v":0},{"$f":"+'AUX2'!J5","v":"m"}]
[null,{"$f":"+'AUX2'!M14","v":63.091997970258099},"U start, V",{"$f":"+O5*1","v":2.3406277280956131},null,1,2,3,4,5,6,7,8,9,"iteration10"]
[null,null,null,null,"mult.",{"$f":"F6+F5*F4","v":64.308917645817942},{"$f":"G6+G5*G4","v":63.115785148219771},63.092472180672154,63.092007427576306,63.09199815886965,63.091997974019662,63.091997970333118,63.091997970259598,63.09199797025812,63.091997970258106]
[null,null,"cable type","cable",0,{"$f":"VLOOKUP($D4,specs!$K$5:$L$19,2)*IF($E$1=\"m\",$D5,($D5*0.3048))/1000","v":0},{"$f":"VLOOKUP($D4,specs!$K$5:$L$19,2)*IF($E$1=\"m\",$D5,($D5*0.3048))/1000","v":0},{"$f":"VLOOKUP($D4,specs!$K$5:$L$19,2)*IF($E$1=\"m\",$D5,($D5*0.3048))/1000","v":0},{"$f":"VLOOKUP($D4,specs!$K$5:$L$19,2)*IF($E$1=\"m\",$D5,($D5*0.3048))/1000","v":0},{"$f":"VLOOKUP($D4,specs!$K$5:$L$19,2)*IF($E$1=\"m\",$D5,($D5*0.3048))/1000","v":0},{"$f":"VLOOKUP($D4,specs!$K$5:$L$19,2)*IF($E$1=\"m\",$D5,($D5*0.3048))/1000","v":0},{"$f":"VLOOKUP($D4,specs!$K$5:$L$19,2)*IF($E$1=\"m\",$D5,($D5*0.3048))/1000","v":0},{"$f":"VLOOKUP($D4,specs!$K$5:$L$19,2)*IF($E$1=\"m\",$D5,($D5*0.3048))/1000","v":0},{"$f":"VLOOKUP($D4,specs!$K$5:$L$19,2)*IF($E$1=\"m\",$D5,($D5*0.3048))/1000","v":0},{"$f":"VLOOKUP($D4,specs!$K$5:$L$19,2)*IF($E$1=\"m\",$D5,($D5*0.3048))/1000","v":0}]
[null,null,"span length,m",0,0,{"$f":"VLOOKUP($D6,specs!$D$5:$H$17,4)/F6*1.03*$E6+F8","v":2.2954851710424169},{"$f":"VLOOKUP($D6,specs!$D$5:$H$17,4)/G6*1.03*$E6+G8","v":2.339728140739564},{"$f":"VLOOKUP($D6,specs!$D$5:$H$17,4)/H6*1.03*$E6+H8","v":2.3406097875012293},{"$f":"VLOOKUP($D6,specs!$D$5:$H$17,4)/I6*1.03*$E6+I8","v":2.3406273702983302},{"$f":"VLOOKUP($D6,specs!$D$5:$H$17,4)/J6*1.03*$E6+J8","v":2.3406277209599002},{"$f":"VLOOKUP($D6,specs!$D$5:$H$17,4)/K6*1.03*$E6+K8","v":2.3406277279533025},{"$f":"VLOOKUP($D6,specs!$D$5:$H$17,4)/L6*1.03*$E6+L8","v":2.340627728092775},{"$f":"VLOOKUP($D6,specs!$D$5:$H$17,4)/M6*1.03*$E6+M8","v":2.3406277280955567},{"$f":"VLOOKUP($D6,specs!$D$5:$H$17,4)/N6*1.03*$E6+N8","v":2.3406277280956123},{"$f":"VLOOKUP($D6,specs!$D$5:$H$17,4)/O6*1.03*$E6+O8","v":2.3406277280956131}]
[null,null,"amplifier","TNA","1",{"$f":"F9+F8*F7","v":64.308917645817942},{"$f":"G9+G8*G7","v":63.115785148219771},63.092472180672154,63.092007427576306,63.09199815886965,63.091997974019662,63.091997970333118,63.091997970259598,63.09199797025812,63.091997970258106]
{"$rows_left_out":29}
{"sheet":"Net41","index":3,"n_rows":34,"n_cols":15,"rows_kept":34,"cut":false,"hidden":true,"merged":[[0,7,0,11],[23,2,24,10],[33,5,34,7],[26,12,27,12]]}
[null,{"$f":"SUM(F22:O22)","v":0},null,{"$f":"IF(O21<'AUX2'!B6,1,0)","v":0},{"$f":"+'AUX2'!J5","v":"m"}]
[null,{"$f":"+'AUX2'!M13","v":63.091997970258099},"U start, V",{"$f":"+O5*1","v":0.99606359520953225},null,1,2,3,4,5,6,7,8,9,"iteration10"]
[null,null,null,null,"mult.",{"$f":"F6+F5*F4","v":64.389487713051949},{"$f":"G6+G5*G4","v":63.119102165420202},63.092576218657136,63.092010312255901,63.091998233685295,63.091997975880673,63.091997970378117,63.091997970260657,63.091997970258149,63.091997970258099]
[null,null,"cable type","QR540",0,{"$f":"VLOOKUP($D4,specs!$K$5:$L$19,2)*IF($E$1=\"m\",$D5,($D5*0.3048))/1000","v":0.77088000000000001},{"$f":"VLOOKUP($D4,specs!$K$5:$L$19,2)*IF($E$1=\"m\",$D5,($D5*0.3048))/1000","v":0.77088000000000001},{"$f":"VLOOKUP($D4,specs!$K$5:$L$19,2)*IF($E$1=\"m\",$D5,($D5*0.3048))/1000","v":0.77088000000000001},{"$f":"VLOOKUP($D4,specs!$K$5:$L$19,2)*IF($E$1=\"m\",$D5,($D5*0.3048))/1000","v":0.77088000000000001},{"$f":"VLOOKUP($D4,specs!$K$5:$L$19,2)*IF($E$1=\"m\",$D5,($D5*0.3048))/1000","v":0.77088000000000001},{"$f":"VLOOKUP($D4,specs!$K$5:$L$19,2)*IF($E$1=\"m\",$D5,($D5*0.3048))/1000","v":0.77088000000000001},{"$f":"VLOOKUP($D4,specs!$K$5:$L$19,2)*IF($E$1=\"m\",$D5,($D5*0.3048))/1000","v":0.77088000000000001},{"$f":"VLOOKUP($D4,specs!$K$5:$L$19,2)*IF($E$1=\"m\",$D5,($D5*0.3048))/1000","v":0.77088000000000001},{"$f":"VLOOKUP($D4,specs!$K$5:$L$19,2)*IF($E$1=\"m\",$D5,($D5*0.3048))/1000","v":0.77088000000000001},{"$f":"VLOOKUP($D4,specs!$K$5:$L$19,2)*IF($E$1=\"m\",$D5,($D5*0.3048))/1000","v":0.77088000000000001}]
[null,null,"span length,m","146",0,{"$f":"VLOOKUP($D6,specs!$D$5:$H$17,4)/F6*1.03*$E6+F8","v":0.97532275870450624},{"$f":"VLOOKUP($D6,specs!$D$5:$H$17,4)/G6*1.03*$E6+G8","v":0.99562115109806859},{"$f":"VLOOKUP($D6,specs!$D$5:$H$17,4)/H6*1.03*$E6+H8","v":0.99605415180789936},{"$f":"VLOOKUP($D6,specs!$D$5:$H$17,4)/I6*1.03*$E6+I8","v":0.99606339364988661},{"$f":"VLOOKUP($D6,specs!$D$5:$H$17,4)/J6*1.03*$E6+J8","v":0.99606359090744889},{"$f":"VLOOKUP($D6,specs!$D$5:$H$17,4)/K6*1.03*$E6+K8","v":0.99606359511770881},{"$f":"VLOOKUP($D6,specs!$D$5:$H$17,4)/L6*1.03*$E6+L8","v":0.99606359520757226},{"$f":"VLOOKUP($D6,specs!$D$5:$H$17,4)/M6*1.03*$E6+M8","v":0.9960635952094905},{"$f":"VLOOKUP($D6,specs!$D$5:$H$17,4)/N6*1.03*$E6+N8","v":0.99606359520953136},{"$f":"VLOOKUP($D6,specs!$D$5:$H$17,4)/O6*1.03*$E6+O8","v":0.99606359520953225}]
[null,null,"amplifier","LEX","1",{"$f":"F9+F8*F7","v":63.637630904821819},{"$f":"G9+G8*G7","v":62.35159773246172},62.324737994111466,62.324164963359074,62.32415273272656,62.324152471676335,62.324152466104501,62.324152465985563,62.324152465983026,62.324152465982976]
{"$rows_left_out":29}
{"sheet":"Net32","index":4,"n_rows":34,"n_cols":15,"rows_kept":34,"cut":false,"hidden":true,"merged":[[0,7,0,11],[23,2,24,10],[33,5,34,7],[26,12,27,12]]}
[null,{"$f":"SUM(F22:O22)","v":0},null,{"$f":"IF(O21<'AUX2'!B6,1,0)","v":0},{"$f":"+'AUX2'!J5","v":"m"}]
[null,{"$f":"'AUX2'!M12","v":63.091997970258099},"U start, V",{"$f":"+O5*1","v":2.7358239864293399},null,1,2,3,4,5,6,7,8,9,"iteration10"]
[null,null,null,null,"mult.",{"$f":"F6+F5*F4","v":69.39778269765813},{"$f":"G6+G5*G4","v":63.782610184088441},63.176868516846625,63.102569098205684,63.093316861311827,63.092162553906533,63.092018509088057,63.092000533361457,63.091998290115711,63.09199801017413]
[null,null,"cable type","QR540",0,{"$f":"VLOOKUP($D4,specs!$K$5:$L$19,2)*IF($E$1=\"m\",$D5,($D5*0.3048))/1000","v":2.1120000000000001},{"$f":"VLOOKUP($D4,specs!$K$5:$L$19,2)*IF($E$1=\"m\",$D5,($D5*0.3048))/1000","v":2.1120000000000001},{"$f":"VLOOKUP($D4,specs!$K$5:$L$19,2)*IF($E$1=\"m\",$D5,($D5*0.3048))/1000","v":2.1120000000000001},{"$f":"VLOOKUP($D4,specs!$K$5:$L$19,2)*IF($E$1=\"m\",$D5,($D5*0.3048))/1000","v":2.1120000000000001},{"$f":"VLOOKUP($D4,specs!$K$5:$L$19,2)*IF($E$1=\"m\",$D5,($D5*0.3048))/1000","v":2.1120000000000001},{"$f":"VLOOKUP($D4,specs!$K$5:$L$19,2)*IF($E$1=\"m\",$D5,($D5*0.3048))/1000","v":2.1120000000000001},{"$f":"VLOOKUP($D4,specs!$K$5:$L$19,2)*IF($E$1=\"m\",$D5,($D5*0.3048))/1000","v":2.1120000000000001},{"$f":"VLOOKUP($D4,specs!$K$5:$L$19,2)*IF($E$1=\"m\",$D5,($D5*0.3048))/1000","v":2.1120000000000001},{"$f":"VLOOKUP($D4,specs!$K$5:$L$19,2)*IF($E$1=\"m\",$D5,($D5*0.3048))/1000","v":2.1120000000000001},{"$f":"VLOOKUP($D4,specs!$K$5:$L$19,2)*IF($E$1=\"m\",$D5,($D5*0.3048))/1000","v":2.1120000000000001}]
[null,null,"span length,m","400",0,{"$f":"VLOOKUP($D6,specs!$D$5:$H$17,4)/F6*1.03*$E6+F8","v":2.4325412213116113},{"$f":"VLOOKUP($D6,specs!$D$5:$H$17,4)/G6*1.03*$E6+G8","v":2.6984995469749102},{"$f":"VLOOKUP($D6,specs!$D$5:$H$17,4)/H6*1.03*$E6+H8","v":2.7311741810753469},{"$f":"VLOOKUP($D6,specs!$D$5:$H$17,4)/I6*1.03*$E6+I8","v":2.7352438494161824},{"$f":"VLOOKUP($D6,specs!$D$5:$H$17,4)/J6*1.03*$E6+J8","v":2.7357515931855518},{"$f":"VLOOKUP($D6,specs!$D$5:$H$17,4)/K6*1.03*$E6+K8","v":2.7358149541990038},{"$f":"VLOOKUP($D6,specs!$D$5:$H$17,4)/L6*1.03*$E6+L8","v":2.7358228611873381},{"$f":"VLOOKUP($D6,specs!$D$5:$H$17,4)/M6*1.03*$E6+M8","v":2.7358238479245625},{"$f":"VLOOKUP($D6,specs!$D$5:$H$17,4)/N6*1.03*$E6+N8","v":2.7358239710625663},{"$f":"VLOOKUP($D6,specs!$D$5:$H$17,4)/O6*1.03*$E6+O8","v":2.7358239864293399}]
[null,null,"amplifier","LEX","1",{"$f":"F9+F8*F7","v":64.260255638248012},{"$f":"G9+G8*G7","v":58.083379140877426},57.408628646415494,57.325734088238704,57.315409496503939,57.314121370638233,57.313960626260396,57.31394056654478,57.313938063231575,57.313937750835365]
{"$rows_left_out":29}
{"sheet":"Net31","index":5,"n_rows":34,"n_cols":15,"rows_kept":34,"cut":false,"hidden":true,"merged":[[0,7,0,11],[23,2,24,10],[33,5,34,7],[26,12,27,12]]}
[null,{"$f":"SUM(F22:O22)","v":0},null,{"$f":"IF(O21<'AUX2'!B6,1,0)","v":0},{"$f":"+'AUX2'!J5","v":"m"}]
[null,{"$f":"+'AUX2'!M11","v":63.091997970258099},"U start, V",{"$f":"+O5*1","v":0.49699591284244499},null,1,2,3,4,5,6,7,8,9,"iteration10"]
[null,null,null,null,"mult.",{"$f":"F6+F5*F4","v":63.997076297733457},{"$f":"G6+G5*G4","v":63.105170624307718},63.092192518650243,63.092000844182685,63.091998012712672,63.091997970885252,63.091997970267364,63.091997970258234,63.091997970258099,63.091997970258099]
[null,null,"cable type","QR540",0,{"$f":"VLOOKUP($D4,specs!$K$5:$L$19,2)*IF($E$1=\"m\",$D5,($D5*0.3048))/1000","v":1.8480000000000001},{"$f":"VLOOKUP($D4,specs!$K$5:$L$19,2)*IF($E$1=\"m\",$D5,($D5*0.3048))/1000","v":1.8480000000000001},{"$f":"VLOOKUP($D4,specs!$K$5:$L$19,2)*IF($E$1=\"m\",$D5,($D5*0.3048))/1000","v":1.8480000000000001},{"$f":"VLOOKUP($D4,specs!$K$5:$L$19,2)*IF($E$1=\"m\",$D5,($D5*0.3048))/1000","v":1.8480000000000001},{"$f":"VLOOKUP($D4,specs!$K$5:$L$19,2)*IF($E$1=\"m\",$D5,($D5*0.3048))/1000","v":1.8480000000000001},{"$f":"VLOOKUP($D4,specs!$K$5:$L$19,2)*IF($E$1=\"m\",$D5,($D5*0.3048))/1000","v":1.8480000000000001},{"$f":"VLOOKUP($D4,specs!$K$5:$L$19,2)*IF($E$1=\"m\",$D5,($D5*0.3048))/1000","v":1.8480000000000001},{"$f":"VLOOKUP($D4,specs!$K$5:$L$19,2)*IF($E$1=\"m\",$D5,($D5*0.3048))/1000","v":1.8480000000000001},{"$f":"VLOOKUP($D4,specs!$K$5:$L$19,2)*IF($E$1=\"m\",$D5,($D5*0.3048))/1000","v":1.8480000000000001},{"$f":"VLOOKUP($D4,specs!$K$5:$L$19,2)*IF($E$1=\"m\",$D5,($D5*0.3048))/1000","v":1.8480000000000001}]
[null,null,"span length,m","350",0,{"$f":"VLOOKUP($D6,specs!$D$5:$H$17,4)/F6*1.03*$E6+F8","v":0.48976099971610382},{"$f":"VLOOKUP($D6,specs!$D$5:$H$17,4)/G6*1.03*$E6+G8","v":0.49688905926676136},{"$f":"VLOOKUP($D6,specs!$D$5:$H$17,4)/H6*1.03*$E6+H8","v":0.49699433437073653},{"$f":"VLOOKUP($D6,specs!$D$5:$H$17,4)/I6*1.03*$E6+I8","v":0.49699588952473467},{"$f":"VLOOKUP($D6,specs!$D$5:$H$17,4)/J6*1.03*$E6+J8","v":0.49699591249798802},{"$f":"VLOOKUP($D6,specs!$D$5:$H$17,4)/K6*1.03*$E6+K8","v":0.49699591283735661},{"$f":"VLOOKUP($D6,specs!$D$5:$H$17,4)/L6*1.03*$E6+L8","v":0.49699591284236988},{"$f":"VLOOKUP($D6,specs!$D$5:$H$17,4)/M6*1.03*$E6+M8","v":0.49699591284244393},{"$f":"VLOOKUP($D6,specs!$D$5:$H$17,4)/N6*1.03*$E6+N8","v":0.49699591284244499},{"$f":"VLOOKUP($D6,specs!$D$5:$H$17,4)/O6*1.03*$E6+O8","v":0.49699591284244499}]
[null,null,"amplifier","LEX","1",{"$f":"F9+F8*F7","v":63.091997970258099},{"$f":"G9+G8*G7","v":62.18691964278274},62.173746988733122,62.173552440340977,62.173549566416391,62.173549523961817,62.173549523334664,62.173549523325399,62.173549523325264,62.173549523325264]
{"$rows_left_out":29}
{"sheet":"Net22","index":6,"n_rows":34,"n_cols":15,"rows_kept":34,"cut":false,"hidden":true,"merged":[[0,7,0,11],[23,2,24,10],[33,5,34,7],[26,12,27,12]]}
[null,{"$f":"SUM(F22:O22)","v":0},null,{"$f":"IF(O21<'AUX2'!B6,1,0)","v":0},{"$f":"+'AUX2'!J5","v":"m"}]
[null,{"$f":"+'AUX2'!M10","v":62.217147471369088},"U start, V",{"$f":"+O5*1","v":0.49846101134393234},null,1,2,3,4,5,6,7,8,9,"iteration10"]
[null,null,null,null,"mult.",{"$f":"F6+F5*F4","v":62.442665235687308},{"$f":"G6+G5*G4","v":62.21796787667644},62.21715046679757,62.217147482306011,62.217147471409021,62.217147471369231,62.217147471369096,62.217147471369088,62.217147471369088,62.217147471369088]
[null,null,"cable type","QR540",0,{"$f":"VLOOKUP($D4,specs!$K$5:$L$19,2)*IF($E$1=\"m\",$D5,($D5*0.3048))/1000","v":0.45408000000000004},{"$f":"VLOOKUP($D4,specs!$K$5:$L$19,2)*IF($E$1=\"m\",$D5,($D5*0.3048))/1000","v":0.45408000000000004},{"$f":"VLOOKUP($D4,specs!$K$5:$L$19,2)*IF($E$1=\"m\",$D5,($D5*0.3048))/1000","v":0.45408000000000004},{"$f":"VLOOKUP($D4,specs!$K$5:$L$19,2)*IF($E$1=\"m\",$D5,($D5*0.3048))/1000","v":0.45408000000000004},{"$f":"VLOOKUP($D4,specs!$K$5:$L$19,2)*IF($E$1=\"m\",$D5,($D5*0.3048))/1000","v":0.45408000000000004},{"$f":"VLOOKUP($D4,specs!$K$5:$L$19,2)*IF($E$1=\"m\",$D5,($D5*0.3048))/1000","v":0.45408000000000004},{"$f":"VLOOKUP($D4,specs!$K$5:$L$19,2)*IF($E$1=\"m\",$D5,($D5*0.3048))/1000","v":0.45408000000000004},{"$f":"VLOOKUP($D4,specs!$K$5:$L$19,2)*IF($E$1=\"m\",$D5,($D5*0.3048))/1000","v":0.45408000000000004},{"$f":"VLOOKUP($D4,specs!$K$5:$L$19,2)*IF($E$1=\"m\",$D5,($D5*0.3048))/1000","v":0.45408000000000004},{"$f":"VLOOKUP($D4,specs!$K$5:$L$19,2)*IF($E$1=\"m\",$D5,($D5*0.3048))/1000","v":0.45408000000000004}]
[null,null,"span length,m","86",0,{"$f":"VLOOKUP($D6,specs!$D$5:$H$17,4)/F6*1.03*$E6+F8","v":0.49664764869233963},{"$f":"VLOOKUP($D6,specs!$D$5:$H$17,4)/G6*1.03*$E6+G8","v":0.49845439047209733},{"$f":"VLOOKUP($D6,specs!$D$5:$H$17,4)/H6*1.03*$E6+H8","v":0.4984609871697695},{"$f":"VLOOKUP($D6,specs!$D$5:$H$17,4)/I6*1.03*$E6+I8","v":0.49846101125566744},{"$f":"VLOOKUP($D6,specs!$D$5:$H$17,4)/J6*1.03*$E6+J8","v":0.49846101134361004},{"$f":"VLOOKUP($D6,specs!$D$5:$H$17,4)/K6*1.03*$E6+K8","v":0.49846101134393112},{"$f":"VLOOKUP($D6,specs!$D$5:$H$17,4)/L6*1.03*$E6+L8","v":0.49846101134393228},{"$f":"VLOOKUP($D6,specs!$D$5:$H$17,4)/M6*1.03*$E6+M8","v":0.49846101134393234},{"$f":"VLOOKUP($D6,specs!$D$5:$H$17,4)/N6*1.03*$E6+N8","v":0.49846101134393234},{"$f":"VLOOKUP($D6,specs!$D$5:$H$17,4)/O6*1.03*$E6+O8","v":0.49846101134393234}]
[null,null,"amplifier","LEX","1",{"$f":"F9+F8*F7","v":62.217147471369088},{"$f":"G9+G8*G7","v":61.991629707050869},61.990809301743518,61.990806306315037,61.990806295378114,61.990806295338182,61.990806295338039,61.990806295338032,61.990806295338032,61.990806295338032]
{"$rows_left_out":29}
{"sheet":"Net21","index":7,"n_rows":34,"n_cols":15,"rows_kept":34,"cut":false,"hidden":true,"merged":[[0,7,0,11],[23,2,24,10],[33,5,34,7],[26,12,27,12]]}
[null,{"$f":"SUM(F22:O22)","v":0},null,{"$f":"IF(O21<'AUX2'!B6,1,0)","v":0},{"$f":"+'AUX2'!J5","v":"m"}]
[null,{"$f":"+'AUX2'!M9","v":62.217147471369088},"U start, V",{"$f":"+O5*1","v":0.49869390543214021},null,1,2,3,4,5,6,7,8,9,"iteration10"]
[null,null,null,null,"mult.",{"$f":"F6+F5*F4","v":62.47139133568767},{"$f":"G6+G5*G4","v":62.218190675266598},62.217151769439909,62.217147489077732,62.217147471442054,62.217147471369387,62.217147471369088,62.217147471369088,62.217147471369088,62.217147471369088]
[null,null,"cable type","QR860",0,{"$f":"VLOOKUP($D4,specs!$K$5:$L$19,2)*IF($E$1=\"m\",$D5,($D5*0.3048))/1000","v":0.51192000000000004},{"$f":"VLOOKUP($D4,specs!$K$5:$L$19,2)*IF($E$1=\"m\",$D5,($D5*0.3048))/1000","v":0.51192000000000004},{"$f":"VLOOKUP($D4,specs!$K$5:$L$19,2)*IF($E$1=\"m\",$D5,($D5*0.3048))/1000","v":0.51192000000000004},{"$f":"VLOOKUP($D4,specs!$K$5:$L$19,2)*IF($E$1=\"m\",$D5,($D5*0.3048))/1000","v":0.51192000000000004},{"$f":"VLOOKUP($D4,specs!$K$5:$L$19,2)*IF($E$1=\"m\",$D5,($D5*0.3048))/1000","v":0.51192000000000004},{"$f":"VLOOKUP($D4,specs!$K$5:$L$19,2)*IF($E$1=\"m\",$D5,($D5*0.3048))/1000","v":0.51192000000000004},{"$f":"VLOOKUP($D4,specs!$K$5:$L$19,2)*IF($E$1=\"m\",$D5,($D5*0.3048))/1000","v":0.51192000000000004},{"$f":"VLOOKUP($D4,specs!$K$5:$L$19,2)*IF($E$1=\"m\",$D5,($D5*0.3048))/1000","v":0.51192000000000004},{"$f":"VLOOKUP($D4,specs!$K$5:$L$19,2)*IF($E$1=\"m\",$D5,($D5*0.3048))/1000","v":0.51192000000000004},{"$f":"VLOOKUP($D4,specs!$K$5:$L$19,2)*IF($E$1=\"m\",$D5,($D5*0.3048))/1000","v":0.51192000000000004}]
[null,null,"span length,m","216",0,{"$f":"VLOOKUP($D6,specs!$D$5:$H$17,4)/F6*1.03*$E6+F8","v":0.49664764869233963},{"$f":"VLOOKUP($D6,specs!$D$5:$H$17,4)/G6*1.03*$E6+G8","v":0.49868547471497149},{"$f":"VLOOKUP($D6,specs!$D$5:$H$17,4)/H6*1.03*$E6+H8","v":0.49869387069642634},{"$f":"VLOOKUP($D6,specs!$D$5:$H$17,4)/I6*1.03*$E6+I8","v":0.49869390528902424},{"$f":"VLOOKUP($D6,specs!$D$5:$H$17,4)/J6*1.03*$E6+J8","v":0.49869390543155051},{"$f":"VLOOKUP($D6,specs!$D$5:$H$17,4)/K6*1.03*$E6+K8","v":0.49869390543213782},{"$f":"VLOOKUP($D6,specs!$D$5:$H$17,4)/L6*1.03*$E6+L8","v":0.49869390543214021},{"$f":"VLOOKUP($D6,specs!$D$5:$H$17,4)/M6*1.03*$E6+M8","v":0.49869390543214021},{"$f":"VLOOKUP($D6,specs!$D$5:$H$17,4)/N6*1.03*$E6+N8","v":0.49869390543214021},{"$f":"VLOOKUP($D6,specs!$D$5:$H$17,4)/O6*1.03*$E6+O8","v":0.49869390543214021}]
[null,null,"amplifier","LEX","1",{"$f":"F9+F8*F7","v":62.217147471369088},{"$f":"G9+G8*G7","v":61.962903607050507},61.961860403152997,61.961856105082177,61.961856087373533,61.961856087300568,61.961856087300269,61.961856087300269,61.961856087300269,61.961856087300269]
{"$rows_left_out":29}
{"sheet":"Net12","index":8,"n_rows":34,"n_cols":15,"rows_kept":34,"cut":false,"hidden":true,"merged":[[0,7,0,11],[23,2,24,10],[33,5,34,7],[26,12,27,12]]}
[null,{"$f":"SUM(F22:O22)","v":0},null,{"$f":"IF(O21<'AUX2'!B6,1,0)","v":0},{"$f":"+'AUX2'!J5","v":"m"}]
[null,{"$f":"+'AUX2'!M8","v":61.802132578521636},"U start, V",{"$f":"+O5*1","v":1.0098436206895918},null,1,2,3,4,5,6,7,8,9,"iteration10"]
[null,null,null,null,"mult.",{"$f":"F6+F5*F4","v":62.542894819686175},{"$f":"G6+G5*G4","v":61.811093218411415},61.802242296333993,61.802133922151022,61.802132594976051,61.802132578723146,61.802132578524102,61.802132578521665,61.802132578521636,61.802132578521636]
[null,null,"cable type","QR540",0,{"$f":"VLOOKUP($D4,specs!$K$5:$L$19,2)*IF($E$1=\"m\",$D5,($D5*0.3048))/1000","v":0.45408000000000004},{"$f":"VLOOKUP($D4,specs!$K$5:$L$19,2)*IF($E$1=\"m\",$D5,($D5*0.3048))/1000","v":0.45408000000000004},{"$f":"VLOOKUP($D4,specs!$K$5:$L$19,2)*IF($E$1=\"m\",$D5,($D5*0.3048))/1000","v":0.45408000000000004},{"$f":"VLOOKUP($D4,specs!$K$5:$L$19,2)*IF($E$1=\"m\",$D5,($D5*0.3048))/1000","v":0.45408000000000004},{"$f":"VLOOKUP($D4,specs!$K$5:$L$19,2)*IF($E$1=\"m\",$D5,($D5*0.3048))/1000","v":0.45408000000000004},{"$f":"VLOOKUP($D4,specs!$K$5:$L$19,2)*IF($E$1=\"m\",$D5,($D5*0.3048))/1000","v":0.45408000000000004},{"$f":"VLOOKUP($D4,specs!$K$5:$L$19,2)*IF($E$1=\"m\",$D5,($D5*0.3048))/1000","v":0.45408000000000004},{"$f":"VLOOKUP($D4,specs!$K$5:$L$19,2)*IF($E$1=\"m\",$D5,($D5*0.3048))/1000","v":0.45408000000000004},{"$f":"VLOOKUP($D4,specs!$K$5:$L$19,2)*IF($E$1=\"m\",$D5,($D5*0.3048))/1000","v":0.45408000000000004},{"$f":"VLOOKUP($D4,specs!$K$5:$L$19,2)*IF($E$1=\"m\",$D5,($D5*0.3048))/1000","v":0.45408000000000004}]
[null,null,"span length,m","86",0,{"$f":"VLOOKUP($D6,specs!$D$5:$H$17,4)/F6*1.03*$E6+F8","v":0.99764836762253295},{"$f":"VLOOKUP($D6,specs!$D$5:$H$17,4)/G6*1.03*$E6+G8","v":1.0096943015798467},{"$f":"VLOOKUP($D6,specs!$D$5:$H$17,4)/H6*1.03*$E6+H8","v":1.0098417920943787},{"$f":"VLOOKUP($D6,specs!$D$5:$H$17,4)/I6*1.03*$E6+I8","v":1.0098435982961569},{"$f":"VLOOKUP($D6,specs!$D$5:$H$17,4)/J6*1.03*$E6+J8","v":1.0098436204153565},{"$f":"VLOOKUP($D6,specs!$D$5:$H$17,4)/K6*1.03*$E6+K8","v":1.0098436206862336},{"$f":"VLOOKUP($D6,specs!$D$5:$H$17,4)/L6*1.03*$E6+L8","v":1.0098436206895509},{"$f":"VLOOKUP($D6,specs!$D$5:$H$17,4)/M6*1.03*$E6+M8","v":1.0098436206895913},{"$f":"VLOOKUP($D6,specs!$D$5:$H$17,4)/N6*1.03*$E6+N8","v":1.0098436206895918},{"$f":"VLOOKUP($D6,specs!$D$5:$H$17,4)/O6*1.03*$E6+O8","v":1.0098436206895918}]
[null,null,"amplifier","LEX","1",{"$f":"F9+F8*F7","v":62.089882648916138},{"$f":"G9+G8*G7","v":61.352611229950035},61.343693335379776,61.3435841410367,61.343582803817846,61.343582787441939,61.343582787241388,61.343582787238937,61.343582787238908,61.343582787238908]
{"$rows_left_out":29}
{"sheet":"Net11","index":9,"n_rows":34,"n_cols":15,"rows_kept":34,"cut":false,"hidden":true,"merged":[[0,7,0,11],[23,2,24,10],[33,5,34,7],[26,12,27,12]]}
[null,{"$f":"SUM(F22:O22)","v":0},null,{"$f":"IF(O21<'AUX2'!B6,1,0)","v":0},{"$f":"+'AUX2'!J5","v":"m"}]
[null,{"$f":"+'AUX2'!M7","v":61.802132578521636},"U start, V",{"$f":"+O5*1","v":1.0055794994991896},null,1,2,3,4,5,6,7,8,9,"iteration10"]
[null,null,null,null,"mult.",{"$f":"F6+F5*F4","v":62.337572841165034},{"$f":"G6+G5*G4","v":61.806803942509525},61.802173691478288,61.802132940387011,61.802132581706687,61.802132578549667,61.802132578521878,61.802132578521636,61.802132578521636,{"$f":"O6+O5*O4","v":61.802132578521636}]
[null,null,"cable type","QR540",0,{"$f":"VLOOKUP($D4,specs!$K$5:$L$19,2)*IF($E$1=\"m\",$D5,($D5*0.3048))/1000","v":0.14784},{"$f":"VLOOKUP($D4,specs!$K$5:$L$19,2)*IF($E$1=\"m\",$D5,($D5*0.3048))/1000","v":0.14784},{"$f":"VLOOKUP($D4,specs!$K$5:$L$19,2)*IF($E$1=\"m\",$D5,($D5*0.3048))/1000","v":0.14784},{"$f":"VLOOKUP($D4,specs!$K$5:$L$19,2)*IF($E$1=\"m\",$D5,($D5*0.3048))/1000","v":0.14784},{"$f":"VLOOKUP($D4,specs!$K$5:$L$19,2)*IF($E$1=\"m\",$D5,($D5*0.3048))/1000","v":0.14784},{"$f":"VLOOKUP($D4,specs!$K$5:$L$19,2)*IF($E$1=\"m\",$D5,($D5*0.3048))/1000","v":0.14784},{"$f":"VLOOKUP($D4,specs!$K$5:$L$19,2)*IF($E$1=\"m\",$D5,($D5*0.3048))/1000","v":0.14784},{"$f":"VLOOKUP($D4,specs!$K$5:$L$19,2)*IF($E$1=\"m\",$D5,($D5*0.3048))/1000","v":0.14784},{"$f":"VLOOKUP($D4,specs!$K$5:$L$19,2)*IF($E$1=\"m\",$D5,($D5*0.3048))/1000","v":0.14784},{"$f":"VLOOKUP($D4,specs!$K$5:$L$19,2)*IF($E$1=\"m\",$D5,($D5*0.3048))/1000","v":0.14784}]
[null,null,"span length,m","28",0,{"$f":"VLOOKUP($D6,specs!$D$5:$H$17,4)/F6*1.03*$E6+F8","v":0.99684560299123615},{"$f":"VLOOKUP($D6,specs!$D$5:$H$17,4)/G6*1.03*$E6+G8","v":1.0055026364636939},{"$f":"VLOOKUP($D6,specs!$D$5:$H$17,4)/H6*1.03*$E6+H8","v":1.00557882297142},{"$f":"VLOOKUP($D6,specs!$D$5:$H$17,4)/I6*1.03*$E6+I8","v":1.005579493544567},{"$f":"VLOOKUP($D6,specs!$D$5:$H$17,4)/J6*1.03*$E6+J8","v":1.0055794994467786},{"$f":"VLOOKUP($D6,specs!$D$5:$H$17,4)/K6*1.03*$E6+K8","v":1.0055794994987284},{"$f":"VLOOKUP($D6,specs!$D$5:$H$17,4)/L6*1.03*$E6+L8","v":1.0055794994991856},{"$f":"VLOOKUP($D6,specs!$D$5:$H$17,4)/M6*1.03*$E6+M8","v":1.0055794994991896},{"$f":"VLOOKUP($D6,specs!$D$5:$H$17,4)/N6*1.03*$E6+N8","v":1.0055794994991896},{"$f":"VLOOKUP($D6,specs!$D$5:$H$17,4)/O6*1.03*$E6+O8","v":1.0055794994991896}]
[null,null,"amplifier","LEX","1",{"$f":"F9+F8*F7","v":62.190199187218809},{"$f":"G9+G8*G7","v":61.658150432734736},61.653508918290193,61.653468068061379,61.653467708508472,61.653467705343772,61.653467705315919,61.653467705315677,61.653467705315677,{"$f":"O9+O8*O7","v":61.653467705315677}]
{"$rows_left_out":29}
{"sheet":"AUX","index":10,"n_rows":13,"n_cols":27,"rows_kept":13,"cut":false,"hidden":true,"merged":[[1,3,1,5],[1,7,1,9]]}
[]
[null,null,null,"R,Ohm",null,null,null,"Vdrop,V"]
[null,"length,m","I,A",540,860,750,"3x10",540,860,750,"3x10","amp type","Inom,A","Vnom,V","Pnom,W","factor_i","cable","loop_res",null,null,null,null,null,null,null,null,"LIST"]
[1,null,null,{"$f":"B4*$R$4","v":0},{"$f":"B4*$R$5","v":0},{"$f":"B4*$R$6","v":0},{"$f":"+B4*$R$7","v":0},{"$f":"$C4*D4","v":0},{"$f":"$C4*E4","v":0},{"$f":"$C4*F4","v":0},{"$f":"$C4*G4","v":0},"HLN",1.4,60,84,{"$f":"M4/(O4/N4)","v":1},"QR540",{"$f":"S4/1000","v":5.28E-3},5.28,"C500",{"$f":"V4/1000","v":5.64E-3},5.64,null,null,null,null,"Net11"]
[2,null,null,0,0,0,{"$f":"+B5*$R$7","v":0},{"$f":"$C5*D5","v":0},{"$f":"$C5*E5","v":0},{"$f":"$C5*F5","v":0},{"$f":"$C5*G5","v":0},"TNA",1,60,60,{"$f":"M5/(O5/N5)","v":1},"QR860",{"$f":"S5/1000","v":2.3700000000000001E-3},2.37,"C625",{"$f":"V5/1000","v":3.6099999999999999E-3},3.61,null,null,null,null,"Net12"]
[3,null,null,0,0,0,{"$f":"+B6*$R$7","v":0},0,0,0,0,"LEX",0.5,60,36,{"$f":"M6/(O6/N6)","v":0.83333333333333337},"C750",{"$f":"S6/1000","v":2.49E-3},2.4900000000000002,null,null,null,null,null,null,null,"Net21"]
{"$rows_left_out":8}
{"sheet":"specs","index":11,"n_rows":19,"n_cols":15,"rows_kept":19,"cut":false,"hidden":false,"merged":[[19,10,20,13]]}
[]
[]
[null,null,null,1,2,3,4,5,null,null,1,2]
[null,null,"amp type","sorted","Inom,A","Vnom,V","Pnom,W",null,"original","cable","sorted","loop_res",null,null,"original"]
[null,null,"load","DBLE",null,60,30,1,30,"cable","2x10",3.66,"cable",1,3.66]
[null,null,"HLN","future1",null,60,0,1,0,"QR860","2x6",6,"QR860",2,6]
{"$rows_left_out":13}